Reaction Details
TargetPolyunsaturated fatty acid lipoxygenase ALOX12
LigandBDBM50446420
Substrate/Competitorn/a
Meas. Tech.ChEMBL_1287333 (CHEMBL3111163)
IC50>10000±n/a nM
Citation Filosa, RPeduto, AAparoy, PSchaible, AMLuderer, SKrauth, VPetronzi, CMassa, Ade Rosa, MReddanna, PWerz, O Discovery and biological evaluation of novel 1,4-benzoquinone and related resorcinol derivatives that inhibit 5-lipoxygenase. Eur J Med Chem67:269-79 (2013) 
 
Polyunsaturated fatty acid lipoxygenase ALOX12
Name:Polyunsaturated fatty acid lipoxygenase ALOX12
Type:Protein
Mol. Mass.:75689.18
Organism:Homo sapiens (Human)
Description:P18054
Residue:663
BDBM50446420
NameBDBM50446420
Synonyms:CHEMBL3109730
TypeSmall organic molecule
Emp. Form.C17H22O4
Mol. Mass.290.3542
SMILESO=C1CC(=O)C(=O)C(CC2CCC3CCCCC3C2)C1=O