Reaction Details
TargetPolyunsaturated fatty acid 5-lipoxygenase
LigandBDBM50000541
Substrate/Competitorn/a
Meas. Tech.ChEMBL_1287337 (CHEMBL3111167)
IC50 1100±n/a nM
Citation Filosa, RPeduto, AAparoy, PSchaible, AMLuderer, SKrauth, VPetronzi, CMassa, Ade Rosa, MReddanna, PWerz, O Discovery and biological evaluation of novel 1,4-benzoquinone and related resorcinol derivatives that inhibit 5-lipoxygenase. Eur J Med Chem67:269-79 (2013) 
 
Polyunsaturated fatty acid 5-lipoxygenase
Name:Polyunsaturated fatty acid 5-lipoxygenase
Type:Enzyme
Mol. Mass.:77972.74
Organism:Homo sapiens (Human)
Description:Recombinant protein was purified from E. coli lysate. After ammonium sulfate precipitation and subsequent steps, the supernatant (S100) was used for 5-LO activity assay.
Residue:674
BDBM50000541
NameBDBM50000541
Synonyms:(+-)-1-(1-Benzo[b]thien-2-ylethyl)-1-hydroxyurea CHEMBL93 N-(1-Benzo(b)thien-2-ylethyl)-N-hydroxyurea ZILEUTON | Zyflo (TN)
TypeSmall organic molecule
Emp. Form.C11H12N2O2S
Mol. Mass.236.29
SMILESCC(N(O)C(N)=O)c1cc2ccccc2s1