Reaction Details
TargetInhibitor of nuclear factor kappa-B kinase subunit beta
LigandBDBM2579
Substrate/Competitorn/a
Meas. Tech.ChEMBL_1290317 (CHEMBL3118639)
IC50 1.000000±n/a nM
Citation Liu, TZhan, WWang, YZhang, LYang, BDong, XHu, Y Structure-based design, synthesis and biological evaluation of diphenylmethylamine derivatives as novel Akt1 inhibitors. Eur J Med Chem73:167-76 (2014) 
 
Inhibitor of nuclear factor kappa-B kinase subunit beta
Name:Inhibitor of nuclear factor kappa-B kinase subunit beta
Type:Serine/threonine-protein kinase
Mol. Mass.:86554.39
Organism:Homo sapiens (Human)
Description:GST-tagged IKK-2 was expressed in High Five cells and purified.
Residue:756
BDBM2579
NameBDBM2579
Synonyms:(2S,3R,4R,6R)-3-methoxy-2-methyl-4-(methylamino)-29-oxa-1,7,17-triazaoctacyclo[12.12.2.1^{2,6}.0^{7,28}.0^{8,13}.0^{15,19}.0^{20,27}.0^{21,26}]nonacosa-8(13),9,11,14(28),15(19),20(27),21(26),22,24-nonaen-16-one Staurosporin, 4 Staurosporine, 8 US9206188, Staurosporine | US9226923, Staurosporine
TypeSmall organic molecule
Emp. Form.C28H26N4O3
Mol. Mass.466.531
SMILESCN[C@@H]1C[C@H]2O[C@@](C)([C@@H]1OC)n1c3ccccc3c3c4CNC(=O)c4c4c5ccccc5n2c4c13