Reaction Details
TargetRAC-alpha serine/threonine-protein kinase
LigandBDBM50447158
Substrate/Competitorn/a
Meas. Tech.ChEMBL_1290336 (CHEMBL3118849)
IC50 820±n/a nM
Citation Liu, TZhan, WWang, YZhang, LYang, BDong, XHu, Y Structure-based design, synthesis and biological evaluation of diphenylmethylamine derivatives as novel Akt1 inhibitors. Eur J Med Chem73:167-76 (2014) 
 
RAC-alpha serine/threonine-protein kinase
Name:RAC-alpha serine/threonine-protein kinase
Type:Enzyme
Mol. Mass.:55681.25
Organism:Homo sapiens (Human)
Description:P31749
Residue:480
BDBM50447158
NameBDBM50447158
Synonyms:CHEMBL3113150
TypeSmall organic molecule
Emp. Form.C18H19ClN4
Mol. Mass.326.823
SMILESNCCNC(c1ccc(Cl)cc1)c1ccc(cc1)-c1cn[nH]c1