Reaction Details
TargetRAC-alpha serine/threonine-protein kinase
LigandBDBM50447157
Substrate/Competitorn/a
Meas. Tech.ChEMBL_1290336 (CHEMBL3118849)
IC50 38±n/a nM
Citation Liu, TZhan, WWang, YZhang, LYang, BDong, XHu, Y Structure-based design, synthesis and biological evaluation of diphenylmethylamine derivatives as novel Akt1 inhibitors. Eur J Med Chem73:167-76 (2014) 
 
RAC-alpha serine/threonine-protein kinase
Name:RAC-alpha serine/threonine-protein kinase
Type:Enzyme
Mol. Mass.:55681.25
Organism:Homo sapiens (Human)
Description:P31749
Residue:480
BDBM50447157
NameBDBM50447157
Synonyms:CHEMBL3112595
TypeSmall organic molecule
Emp. Form.C20H22ClN3
Mol. Mass.339.862
SMILESCC(C)(C)NC(c1ccc(Cl)cc1)c1ccc(cc1)-c1cn[nH]c1