Reaction Details
TargetRAC-alpha serine/threonine-protein kinase
LigandBDBM50447166
Substrate/Competitorn/a
Meas. Tech.ChEMBL_1290336 (CHEMBL3118849)
IC50 640±n/a nM
Citation Liu, TZhan, WWang, YZhang, LYang, BDong, XHu, Y Structure-based design, synthesis and biological evaluation of diphenylmethylamine derivatives as novel Akt1 inhibitors. Eur J Med Chem73:167-76 (2014) 
 
RAC-alpha serine/threonine-protein kinase
Name:RAC-alpha serine/threonine-protein kinase
Type:Enzyme
Mol. Mass.:55681.25
Organism:Homo sapiens (Human)
Description:P31749
Residue:480
BDBM50447166
NameBDBM50447166
Synonyms:CHEMBL3113141
TypeSmall organic molecule
Emp. Form.C24H24ClN5
Mol. Mass.417.934
SMILESClc1ccc(cc1)C(NC1CCCCC1)c1ccc(cc1)-c1ncnc2nc[nH]c12