Reaction Details
TargetMetabotropic glutamate receptor 1
LigandBDBM50448151
Substrate/Competitorn/a
Meas. Tech.ChEMBL_1292284 (CHEMBL3124715)
IC50>50000±n/a nM
Citation Zhang, LBalan, GBarreiro, GBoscoe, BPChenard, LKCianfrogna, JClaffey, MMChen, LCoffman, KJDrozda, SEDunetz, JRFonseca, KRGalatsis, PGrimwood, SLazzaro, JTMancuso, JYMiller, ELReese, MRRogers, BNSakurada, ISkaddan, MSmith, DLStepan, AFTrapa, PTuttle, JBVerhoest, PRWalker, DPWright, ASZaleska, MMZasadny, KShaffer, CL Discovery and preclinical characterization of 1-methyl-3-(4-methylpyridin-3-yl)-6-(pyridin-2-ylmethoxy)-1H-pyrazolo-[3,4-b]pyrazine (PF470): a highly potent, selective, and efficacious metabotropic glutamate receptor 5 (mGluR5) negative allosteric modulator. J Med Chem57:861-77 (2014) 
 
Metabotropic glutamate receptor 1
Name:Metabotropic glutamate receptor 1
Type:Enzyme
Mol. Mass.:132358.19
Organism:Homo sapiens (Human)
Description:Q13255
Residue:1194
BDBM50448151
NameBDBM50448151
Synonyms:CHEMBL3122226
TypeSmall organic molecule
Emp. Form.C18H19N5O3
Mol. Mass.353.3752
SMILESCn1nc(C(=O)N2CCOCC2)c2ccc(OCc3ccccn3)nc12