Reaction Details
TargetMetabotropic glutamate receptor 5
LigandBDBM50448156
Substrate/Competitorn/a
Meas. Tech.ChEMBL_1292286 (CHEMBL3124717)
Ki 26±n/a nM
Citation Zhang, LBalan, GBarreiro, GBoscoe, BPChenard, LKCianfrogna, JClaffey, MMChen, LCoffman, KJDrozda, SEDunetz, JRFonseca, KRGalatsis, PGrimwood, SLazzaro, JTMancuso, JYMiller, ELReese, MRRogers, BNSakurada, ISkaddan, MSmith, DLStepan, AFTrapa, PTuttle, JBVerhoest, PRWalker, DPWright, ASZaleska, MMZasadny, KShaffer, CL Discovery and preclinical characterization of 1-methyl-3-(4-methylpyridin-3-yl)-6-(pyridin-2-ylmethoxy)-1H-pyrazolo-[3,4-b]pyrazine (PF470): a highly potent, selective, and efficacious metabotropic glutamate receptor 5 (mGluR5) negative allosteric modulator. J Med Chem57:861-77 (2014) 
 
Metabotropic glutamate receptor 5
Name:Metabotropic glutamate receptor 5
Type:Enzyme
Mol. Mass.:132484.72
Organism:Homo sapiens (Human)
Description:n/a
Residue:1212
BDBM50448156
NameBDBM50448156
Synonyms:CHEMBL3122216
TypeSmall organic molecule
Emp. Form.C17H15N7O
Mol. Mass.333.3473
SMILESCc1ccnnc1-c1nn(C)c2nc(OCc3ccccn3)cnc12