Reaction Details
TargetUrease
LigandBDBM50448177
Substrate/Competitorn/a
Meas. Tech.ChEMBL_1293005 (CHEMBL3122984)
Ki 15580±n/a nM
Citation Khan, KMNaz, FTaha, MKhan, APerveen, SChoudhary, MIVoelter, W Synthesis and in vitro urease inhibitory activity of N,N'-disubstituted thioureas. Eur J Med Chem74:314-23 (2014) 
 
Urease
Name:Urease
Type:Enzyme
Mol. Mass.:90746.20
Organism:Canavalia ensiformis (Jack bean) (Horse bean)
Description:P07374
Residue:840
BDBM50448177
NameBDBM50448177
Synonyms:CHEMBL1576403
TypeSmall organic molecule
Emp. Form.C13H11BrN2S
Mol. Mass.307.209
SMILESBrc1cccc(NC(=S)Nc2ccccc2)c1