Reaction Details
TargetUrease
LigandBDBM50448180
Substrate/Competitorn/a
Meas. Tech.ChEMBL_1293005 (CHEMBL3122984)
Ki 18480±n/a nM
Citation Khan, KMNaz, FTaha, MKhan, APerveen, SChoudhary, MIVoelter, W Synthesis and in vitro urease inhibitory activity of N,N'-disubstituted thioureas. Eur J Med Chem74:314-23 (2014) 
 
Urease
Name:Urease
Type:Enzyme
Mol. Mass.:90746.20
Organism:Canavalia ensiformis (Jack bean) (Horse bean)
Description:P07374
Residue:840
BDBM50448180
NameBDBM50448180
Synonyms:CHEMBL3120571
TypeSmall organic molecule
Emp. Form.C14H12Cl2N2S
Mol. Mass.311.229
SMILESCc1ccc(Cl)cc1NC(=S)Nc1cccc(Cl)c1