Reaction Details
TargetHistone-lysine N-methyltransferase EHMT2
LigandBDBM50448442
Substrate/Competitorn/a
Meas. Tech.ChEMBL_1294294 (CHEMBL3128971)
IC50 10600±n/a nM
Citation Cherblanc, FLChapman, KLReid, JBorg, AJSundriyal, SAlcazar-Fuoli, LBignell, EDemetriades, MSchofield, CJDiMaggio, PABrown, RFuchter, MJ On the histone lysine methyltransferase activity of fungal metabolite chaetocin. J Med Chem56:8616-25 (2013) 
 
Histone-lysine N-methyltransferase EHMT2
Name:Histone-lysine N-methyltransferase EHMT2
Type:Enzyme
Mol. Mass.:132339.87
Organism:Homo sapiens (Human)
Description:Q96KQ7
Residue:1210
BDBM50448442
NameBDBM50448442
Synonyms:CHEMBL3124976
TypeSmall organic molecule
Emp. Form.C30H28N6O6S2
Mol. Mass.632.71
SMILESCN1C(=O)[C@@]23C[C@]4([C@H](Nc5ccccc45)N2C(=O)[C@]1(CO)S3)[C@]12C[C@]34S[C@](CO)(N(C)C3=O)C(=O)N4[C@H]1Nc1ccccc21