Reaction Details
TargetcAMP-specific 3',5'-cyclic phosphodiesterase 4A
LigandBDBM50450770
Substrate/Competitorn/a
Meas. Tech.ChEBML_155039
IC50 8.20±n/a nM
Citation Bacher, EBoer, CBray-French, KDemnitz, FWKeller, THMazzoni, LMüller, TWalker, C N-arylrolipram derivatives as potent and selective PDE4 inhibitors. Bioorg Med Chem Lett8:3229-34 (1999) cAMP-specific 3',5'-cyclic phosphodiesterase 4A
Name:cAMP-specific 3',5'-cyclic phosphodiesterase 4A
Type:Enzyme
Mol. Mass.:98113.27
Organism:Homo sapiens (Human)
Description:P27815
Residue:886
BDBM50450770
NameBDBM50450770
Synonyms:CHEMBL320307
TypeSmall organic molecule
Emp. Form.C30H33NO5
Mol. Mass.487.5867
SMILESCOc1cccc(COc2cccc(c2)N2CC(CC2=O)c2ccc(OC)c(OC3CCCC3)c2)c1