Reaction Details
TargetCarbonic anhydrase 1
LigandBDBM50442511
Substrate/Competitorn/a
Meas. Tech.ChEMBL_1337724 (CHEMBL3240043)
IC50 5535±n/a nM
Citation Tauro, MLoiodice, FCeruso, MSupuran, CTTortorella, P Arylamino bisphosphonates: potent and selective inhibitors of the tumor-associated carbonic anhydrase XII. Bioorg Med Chem Lett24:1941-3 (2014) 
 
Carbonic anhydrase 1
Name:Carbonic anhydrase 1
Type:Enzyme
Mol. Mass.:28873.37
Organism:Homo sapiens (Human)
Description:P00915
Residue:261
BDBM50442511
NameBDBM50442511
Synonyms:CHEMBL2440434
TypeSmall organic molecule
Emp. Form.C7H9FN2O8P2
Mol. Mass.330.1009
SMILESOP(O)(=O)C(Nc1ccc(F)c(c1)[N+]([O-])=O)P(O)(O)=O