Reaction Details
TargetCarbonic anhydrase 2
LigandBDBM50442513
Substrate/Competitorn/a
Meas. Tech.ChEMBL_1337725 (CHEMBL3240045)
IC50>10000±n/a nM
Citation Tauro, MLoiodice, FCeruso, MSupuran, CTTortorella, P Arylamino bisphosphonates: potent and selective inhibitors of the tumor-associated carbonic anhydrase XII. Bioorg Med Chem Lett24:1941-3 (2014) 
 
Carbonic anhydrase 2
Name:Carbonic anhydrase 2
Type:Enzyme
Mol. Mass.:29250.71
Organism:Homo sapiens (Human)
Description:P00918
Residue:260
BDBM50442513
NameBDBM50442513
Synonyms:CHEMBL2440436
TypeSmall organic molecule
Emp. Form.C7H10FNO6P2
Mol. Mass.285.1033
SMILESOP(O)(=O)C(Nc1cccc(F)c1)P(O)(O)=O