Reaction Details
TargetCarbonic anhydrase 2
LigandBDBM50442517
Substrate/Competitorn/a
Meas. Tech.ChEMBL_1337725 (CHEMBL3240045)
IC50>10000±n/a nM
Citation Tauro, MLoiodice, FCeruso, MSupuran, CTTortorella, P Arylamino bisphosphonates: potent and selective inhibitors of the tumor-associated carbonic anhydrase XII. Bioorg Med Chem Lett24:1941-3 (2014) 
 
Carbonic anhydrase 2
Name:Carbonic anhydrase 2
Type:Enzyme
Mol. Mass.:29250.71
Organism:Homo sapiens (Human)
Description:P00918
Residue:260
BDBM50442517
NameBDBM50442517
Synonyms:CHEMBL2440440
TypeSmall organic molecule
Emp. Form.C8H10F3NO6P2
Mol. Mass.335.1108
SMILESOP(O)(=O)C(Nc1ccc(cc1)C(F)(F)F)P(O)(O)=O