Reaction Details
TargetCarbonic anhydrase 2
LigandBDBM50442508
Substrate/Competitorn/a
Meas. Tech.ChEMBL_1337725 (CHEMBL3240045)
IC50 7469±n/a nM
Citation Tauro, MLoiodice, FCeruso, MSupuran, CTTortorella, P Arylamino bisphosphonates: potent and selective inhibitors of the tumor-associated carbonic anhydrase XII. Bioorg Med Chem Lett24:1941-3 (2014) 
 
Carbonic anhydrase 2
Name:Carbonic anhydrase 2
Type:Enzyme
Mol. Mass.:29250.71
Organism:Homo sapiens (Human)
Description:P00918
Residue:260
BDBM50442508
NameBDBM50442508
Synonyms:CHEMBL2440432
TypeSmall organic molecule
Emp. Form.C13H14BrNO7P2
Mol. Mass.438.104
SMILESOP(O)(=O)C(Nc1ccc(Oc2ccc(Br)cc2)cc1)P(O)(O)=O