Reaction Details
TargetCarbonic anhydrase 9
LigandBDBM50138040
Substrate/Competitorn/a
Meas. Tech.ChEMBL_1337726 (CHEMBL3240046)
IC50 7629±n/a nM
Citation Tauro, MLoiodice, FCeruso, MSupuran, CTTortorella, P Arylamino bisphosphonates: potent and selective inhibitors of the tumor-associated carbonic anhydrase XII. Bioorg Med Chem Lett24:1941-3 (2014) 
 
Carbonic anhydrase 9
Name:Carbonic anhydrase 9
Type:Enzyme
Mol. Mass.:49669.03
Organism:Homo sapiens (Human)
Description:Catalytic domain of human cloned isozyme was used in the assay
Residue:459
BDBM50138040
NameBDBM50138040
Synonyms:(biphenyl-3-ylamino)methylenediphosphonic acid CHEMBL55371 | [(Biphenyl-3-ylamino)-phosphono-methyl]-phosphonic acid
TypeSmall organic molecule
Emp. Form.C13H15NO6P2
Mol. Mass.343.2088
SMILESOP(O)(=O)C(Nc1cccc(c1)-c1ccccc1)P(O)(O)=O