Reaction Details
TargetCarbonic anhydrase 9
LigandBDBM50442507
Substrate/Competitorn/a
Meas. Tech.ChEMBL_1337726 (CHEMBL3240046)
IC50>10000±n/a nM
Citation Tauro, MLoiodice, FCeruso, MSupuran, CTTortorella, P Arylamino bisphosphonates: potent and selective inhibitors of the tumor-associated carbonic anhydrase XII. Bioorg Med Chem Lett24:1941-3 (2014) 
 
Carbonic anhydrase 9
Name:Carbonic anhydrase 9
Type:Enzyme
Mol. Mass.:49669.03
Organism:Homo sapiens (Human)
Description:Catalytic domain of human cloned isozyme was used in the assay
Residue:459
BDBM50442507
NameBDBM50442507
Synonyms:CHEMBL2440429
TypeSmall organic molecule
Emp. Form.C11H13NO6P2
Mol. Mass.317.1715
SMILESOP(O)(=O)C(Nc1cccc2ccccc12)P(O)(O)=O