Reaction Details
TargetCarbonic anhydrase 12
LigandBDBM50138035
Substrate/Competitorn/a
Meas. Tech.ChEMBL_1337727 (CHEMBL3240047)
IC50>10000±n/a nM
Citation Tauro, MLoiodice, FCeruso, MSupuran, CTTortorella, P Arylamino bisphosphonates: potent and selective inhibitors of the tumor-associated carbonic anhydrase XII. Bioorg Med Chem Lett24:1941-3 (2014) 
 
Carbonic anhydrase 12
Name:Carbonic anhydrase 12
Type:Enzyme
Mol. Mass.:39456.00
Organism:Homo sapiens (Human)
Description:Catalytic domain of human cloned isozyme was used in the assay
Residue:354
BDBM50138035
NameBDBM50138035
Synonyms:(biphenyl-4-yl)-aminomethylene-1,1-bisphosphonate BPH-217 [(Biphenyl-4-ylamino)-phosphono-methyl]-phosphonic acid
TypeSmall organic molecule
Emp. Form.C13H15NO6P2
Mol. Mass.343.2088
SMILESOP(O)(=O)C(Nc1ccc(cc1)-c1ccccc1)P(O)(O)=O