Reaction Details
TargetCarbonic anhydrase 14
LigandBDBM50442520
Substrate/Competitorn/a
Meas. Tech.ChEMBL_1337728 (CHEMBL3240048)
IC50>10000±n/a nM
Citation Tauro, MLoiodice, FCeruso, MSupuran, CTTortorella, P Arylamino bisphosphonates: potent and selective inhibitors of the tumor-associated carbonic anhydrase XII. Bioorg Med Chem Lett24:1941-3 (2014) 
 
Carbonic anhydrase 14
Name:Carbonic anhydrase 14
Type:Enzyme
Mol. Mass.:37665.67
Organism:Homo sapiens (Human)
Description:Human (cloned) isozyme.
Residue:337
BDBM50442520
NameBDBM50442520
Synonyms:CHEMBL2440441
TypeSmall organic molecule
Emp. Form.C7H10BrNO6P2
Mol. Mass.346.009
SMILESOP(O)(=O)C(Nc1ccc(Br)cc1)P(O)(O)=O