Reaction Details
TargetCarbonic anhydrase 14
LigandBDBM50165966
Substrate/Competitorn/a
Meas. Tech.ChEMBL_1337728 (CHEMBL3240048)
IC50 7461±n/a nM
Citation Tauro, MLoiodice, FCeruso, MSupuran, CTTortorella, P Arylamino bisphosphonates: potent and selective inhibitors of the tumor-associated carbonic anhydrase XII. Bioorg Med Chem Lett24:1941-3 (2014) 
 
Carbonic anhydrase 14
Name:Carbonic anhydrase 14
Type:Enzyme
Mol. Mass.:37665.67
Organism:Homo sapiens (Human)
Description:Human (cloned) isozyme.
Residue:337
BDBM50165966
NameBDBM50165966
Synonyms:CHEMBL191613 [(2,4-dichloro-phenyl)aminomethylene]-1,1-bisphosphonate
TypeSmall organic molecule
Emp. Form.C7H9Cl2NO6P2
Mol. Mass.336.003
SMILESOP(O)(=O)C(Nc1ccc(Cl)cc1Cl)P(O)(O)=O