Reaction Details
TargetHistamine H3 receptor
LigandBDBM50001752
Substrate/Competitorn/a
Meas. Tech.ChEMBL_1338135 (CHEMBL3242002)
Ki 0.239883±n/a nM
Citation Sadek, BSchwed, JSSubramanian, DWeizel, LWalter, MAdem, AStark, H Non-imidazole histamine H3 receptor ligands incorporating antiepileptic moieties. Eur J Med Chem77:269-79 (2014) 
 
Histamine H3 receptor
Name:Histamine H3 receptor
Type:G Protein-Coupled Receptor (GPCR)
Mol. Mass.:48691.47
Organism:Homo sapiens (Human)
Description:Binding assays were using CHO cells stably expressing hH3R receptors.
Residue:445
BDBM50001752
NameBDBM50001752
Synonyms:CHEMBL3238445
TypeSmall organic molecule
Emp. Form.C22H27N5O
Mol. Mass.377.4827
SMILESCc1nnc(-c2cccnc2)n1-c1ccc(OCCCN2CCCCC2)cc1