Reaction Details
TargetHistamine H4 receptor
LigandBDBM50247053
Substrate/Competitorn/a
Meas. Tech.ChEMBL_1338136 (CHEMBL3242003)
Ki<10000±n/a nM
Citation Sadek, BSchwed, JSSubramanian, DWeizel, LWalter, MAdem, AStark, H Non-imidazole histamine H3 receptor ligands incorporating antiepileptic moieties. Eur J Med Chem77:269-79 (2014) 
 
Histamine H4 receptor
Name:Histamine H4 receptor
Type:G Protein-Coupled Receptor (GPCR)
Mol. Mass.:44517.02
Organism:Homo sapiens (Human)
Description:Binding assays were using CHO cells stably expressing hH4R receptors.
Residue:390
BDBM50247053
NameBDBM50247053
Synonyms:1-(3-(3-(4-chlorophenyl)propoxy)propyl)piperidine Tiprolisant
TypeSmall organic molecule
Emp. Form.C17H26ClNO
Mol. Mass.295.847
SMILESClc1ccc(CCCOCCCN2CCCCC2)cc1