Reaction Details
TargetDipeptidyl peptidase 4
LigandBDBM50004093
Substrate/Competitorn/a
Meas. Tech.ChEMBL_1337358 (CHEMBL3241352)
IC50 84±n/a nM
Citation Jadav, PBahekar, RShah, SRPatel, DJoharapurkar, AJain, MSairam, KVSingh, PK Design, synthesis and biological evaluation of novel aminomethyl-piperidones based DPP-IV inhibitors. Bioorg Med Chem Lett24:1918-22 (2014) 
 
Dipeptidyl peptidase 4
Name:Dipeptidyl peptidase 4
Type:Enzyme
Mol. Mass.:88271.01
Organism:Homo sapiens (Human)
Description:P27487
Residue:766
BDBM50004093
NameBDBM50004093
Synonyms:CHEMBL3236116
TypeSmall organic molecule
Emp. Form.C19H21F2N3O
Mol. Mass.345.3863
SMILESNC[C@H]1CN(CCc2ccncc2)C(=O)C[C@@H]1c1cc(F)ccc1F