Reaction Details
TargetDipeptidyl peptidase 4
LigandBDBM50004096
Substrate/Competitorn/a
Meas. Tech.ChEMBL_1337358 (CHEMBL3241352)
IC50 79±n/a nM
Citation Jadav, PBahekar, RShah, SRPatel, DJoharapurkar, AJain, MSairam, KVSingh, PK Design, synthesis and biological evaluation of novel aminomethyl-piperidones based DPP-IV inhibitors. Bioorg Med Chem Lett24:1918-22 (2014) 
 
Dipeptidyl peptidase 4
Name:Dipeptidyl peptidase 4
Type:Enzyme
Mol. Mass.:88271.01
Organism:Homo sapiens (Human)
Description:P27487
Residue:766
BDBM50004096
NameBDBM50004096
Synonyms:CHEMBL3236119
TypeSmall organic molecule
Emp. Form.C18H15F5N6O
Mol. Mass.426.3433
SMILESNC[C@H]1CN(C(=O)C[C@@H]1c1cc(F)ccc1F)c1ccc2nnc(n2n1)C(F)(F)F