Reaction Details
TargetTransient receptor potential cation channel subfamily V member 1
LigandBDBM20462
Substrate/Competitorn/a
Meas. Tech.ChEMBL_1334656 (CHEMBL3239856)
EC50 50±n/a nM
Citation Han, SThatte, JBuzard, DJJones, RM Therapeutic utility of cannabinoid receptor type 2 (CB(2)) selective agonists. Cell Chem Biol56:8224-56 (2013) 
 
Transient receptor potential cation channel subfamily V member 1
Name:Transient receptor potential cation channel subfamily V member 1
Type:Protein
Mol. Mass.:94960.75
Organism:Homo sapiens (Human)
Description:Q8NER1
Residue:839
BDBM20462
NameBDBM20462
Synonyms:(5Z,8Z,11Z,14Z)-N-[2-(3,4-dihydroxyphenyl)ethyl]icosa-5,8,11,14-tetraenamide CHEMBL138921 | N-arachidonoyl-dopamine (NADA)
Typen/a
Emp. Form.C28H41NO3
Mol. Mass.439.63
SMILESCCCCC\C=C/C\C=C/C\C=C/C\C=C/CCCC(=O)NCCc1ccc(O)c(O)c1