Reaction Details
TargetCannabinoid receptor 1
LigandBDBM20462
Substrate/Competitorn/a
Meas. Tech.ChEMBL_1334636 (CHEMBL3239836)
Ki 250±n/a nM
Citation Han, SThatte, JBuzard, DJJones, RM Therapeutic utility of cannabinoid receptor type 2 (CB(2)) selective agonists. Cell Chem Biol56:8224-56 (2013) 
 
Cannabinoid receptor 1
Name:Cannabinoid receptor 1
Type:G Protein-Coupled Receptor (GPCR)
Mol. Mass.:52856.55
Organism:Rattus norvegicus (rat)
Description:P20272
Residue:473
BDBM20462
NameBDBM20462
Synonyms:(5Z,8Z,11Z,14Z)-N-[2-(3,4-dihydroxyphenyl)ethyl]icosa-5,8,11,14-tetraenamide CHEMBL138921 | N-arachidonoyl-dopamine (NADA)
Typen/a
Emp. Form.C28H41NO3
Mol. Mass.439.63
SMILESCCCCC\C=C/C\C=C/C\C=C/C\C=C/CCCC(=O)NCCc1ccc(O)c(O)c1