Reaction Details
TargetProstaglandin D2 receptor 2
LigandBDBM50006827
Substrate/Competitorn/a
Meas. Tech.ChEMBL_1337063 (CHEMBL3242797)
IC50 4.0±n/a nM
Citation Kaila, NFollows, BLeung, LThomason, JHuang, AMoretto, AJanz, KLowe, MMansour, TSHubeau, CPage, KMorgan, PFish, SXu, XWilliams, CSaiah, E Discovery of isoquinolinone indole acetic acids as antagonists of chemoattractant receptor homologous molecule expressed on Th2 cells (CRTH2) for the treatment of allergic inflammatory diseases. J Med Chem57:1299-322 (2014) 
 
Prostaglandin D2 receptor 2
Name:Prostaglandin D2 receptor 2
Type:Enzyme
Mol. Mass.:43295.45
Organism:Homo sapiens (Human)
Description:Q9Y5Y4
Residue:395
BDBM50006827
NameBDBM50006827
Synonyms:CHEMBL3236949
TypeSmall organic molecule
Emp. Form.C22H16F4N2O3
Mol. Mass.432.3677
SMILESCc1c(-c2cn(CC(F)(F)F)c(=O)c3ccccc23)c2cc(F)ccc2n1CC(O)=O