Reaction Details
TargetE3 ubiquitin-protein ligase Mdm2
LigandBDBM50007647
Substrate/Competitorn/a
Meas. Tech.ChEMBL_1339578 (CHEMBL3243058)
IC50 3.0±n/a nM
Citation Gonzalez, AZEksterowicz, JBartberger, MDBeck, HPCanon, JChen, AChow, DDuquette, JFox, BMFu, JHuang, XHouze, JBJin, LLi, YLi, ZLing, YLo, MCLong, AMMcGee, LRMcIntosh, JMcMinn, DLOliner, JDOsgood, TRew, YSaiki, AYShaffer, PWortman, SYakowec, PYan, XYe, QYu, DZhao, XZhou, JOlson, SHMedina, JCSun, D Selective and potent morpholinone inhibitors of the MDM2-p53 protein-protein interaction. J Med Chem57:2472-88 (2014) 
 
E3 ubiquitin-protein ligase Mdm2
Name:E3 ubiquitin-protein ligase Mdm2
Type:Oncoprotein
Mol. Mass.:55196.54
Organism:Homo sapiens (Human)
Description:Q00987
Residue:491
BDBM50007647
NameBDBM50007647
Synonyms:CHEMBL3233128
TypeSmall organic molecule
Emp. Form.C24H27Cl2NO6S
Mol. Mass.528.445
SMILESCC[C@@H](CS(=O)(=O)CC)N1[C@@H]([C@H](O[C@H](CC(O)=O)C1=O)c1cccc(Cl)c1)c1ccc(Cl)cc1