Reaction Details
TargetE3 ubiquitin-protein ligase Mdm2
LigandBDBM50007653
Substrate/Competitorn/a
Meas. Tech.ChEMBL_1339578 (CHEMBL3243058)
IC50 5.0±n/a nM
Citation Gonzalez, AZEksterowicz, JBartberger, MDBeck, HPCanon, JChen, AChow, DDuquette, JFox, BMFu, JHuang, XHouze, JBJin, LLi, YLi, ZLing, YLo, MCLong, AMMcGee, LRMcIntosh, JMcMinn, DLOliner, JDOsgood, TRew, YSaiki, AYShaffer, PWortman, SYakowec, PYan, XYe, QYu, DZhao, XZhou, JOlson, SHMedina, JCSun, D Selective and potent morpholinone inhibitors of the MDM2-p53 protein-protein interaction. J Med Chem57:2472-88 (2014) 
 
E3 ubiquitin-protein ligase Mdm2
Name:E3 ubiquitin-protein ligase Mdm2
Type:Oncoprotein
Mol. Mass.:55196.54
Organism:Homo sapiens (Human)
Description:Q00987
Residue:491
BDBM50007653
NameBDBM50007653
Synonyms:CHEMBL3233135
TypeSmall organic molecule
Emp. Form.C25H27Cl2NO7S
Mol. Mass.556.455
SMILESCC[C@@H](CS(=O)(=O)C1COC1)N1[C@@H]([C@H](O[C@H](CC(O)=O)C1=O)c1cccc(Cl)c1)c1ccc(Cl)cc1