Reaction Details
TargetProto-oncogene tyrosine-protein kinase receptor Ret
LigandBDBM50007745
Substrate/Competitorn/a
Meas. Tech.ChEMBL_1335382 (CHEMBL3239033)
IC50>10000±n/a nM
Citation Ji, XPeng, TZhang, XLi, JYang, WTong, LQu, RJiang, HDing, JXie, HLiu, H Design, synthesis and biological evaluation of novel 6-alkenylamides substituted of 4-anilinothieno[2,3-d]pyrimidines as irreversible epidermal growth factor receptor inhibitors. Bioorg Med Chem22:2366-78 (2014) 
 
Proto-oncogene tyrosine-protein kinase receptor Ret
Name:Proto-oncogene tyrosine-protein kinase receptor Ret
Type:Protein
Mol. Mass.:124318.29
Organism:Homo sapiens (Human)
Description:P07949
Residue:1114
BDBM50007745
NameBDBM50007745
Synonyms:CHEMBL3233785
TypeSmall organic molecule
Emp. Form.C23H21ClFN5O2S
Mol. Mass.485.962
SMILESFc1ccc(Nc2ncnc3sc(NC(=O)\C=C\CN4CC5CCC4C(=O)C5)cc23)cc1Cl