Reaction Details
TargetEpidermal growth factor receptor
LigandBDBM50007773
Substrate/Competitorn/a
Meas. Tech.ChEMBL_1335368 (CHEMBL3238947)
IC50 28±n/a nM
Citation Ji, XPeng, TZhang, XLi, JYang, WTong, LQu, RJiang, HDing, JXie, HLiu, H Design, synthesis and biological evaluation of novel 6-alkenylamides substituted of 4-anilinothieno[2,3-d]pyrimidines as irreversible epidermal growth factor receptor inhibitors. Bioorg Med Chem22:2366-78 (2014) 
 
Epidermal growth factor receptor
Name:Epidermal growth factor receptor
Type:Receptor Kinase Domain
Mol. Mass.:134279.59
Organism:Homo sapiens (Human)
Description:P00533
Residue:1210
BDBM50007773
NameBDBM50007773
Synonyms:CHEMBL3233783
TypeSmall organic molecule
Emp. Form.C20H17ClF3N5OS
Mol. Mass.467.895
SMILESFc1ccc(Nc2ncnc3sc(NC(=O)\C=C\CN4CCC(F)(F)C4)cc23)cc1Cl