Reaction Details
TargetEpidermal growth factor receptor
LigandBDBM50007784
Substrate/Competitorn/a
Meas. Tech.ChEMBL_1335368 (CHEMBL3238947)
IC50 29±n/a nM
Citation Ji, XPeng, TZhang, XLi, JYang, WTong, LQu, RJiang, HDing, JXie, HLiu, H Design, synthesis and biological evaluation of novel 6-alkenylamides substituted of 4-anilinothieno[2,3-d]pyrimidines as irreversible epidermal growth factor receptor inhibitors. Bioorg Med Chem22:2366-78 (2014) 
 
Epidermal growth factor receptor
Name:Epidermal growth factor receptor
Type:Receptor Kinase Domain
Mol. Mass.:134279.59
Organism:Homo sapiens (Human)
Description:P00533
Residue:1210
BDBM50007784
NameBDBM50007784
Synonyms:CHEMBL3233793
TypeSmall organic molecule
Emp. Form.C20H19ClFN5O3S2
Mol. Mass.495.978
SMILESFc1ccc(Nc2ncnc3sc(NC(=O)\C=C\CN4CCS(=O)(=O)CC4)cc23)cc1Cl