Reaction Details
TargetFibroblast growth factor receptor 1
LigandBDBM50007745
Substrate/Competitorn/a
Meas. Tech.ChEMBL_1335392 (CHEMBL3239043)
IC50>10000±n/a nM
Citation Ji, XPeng, TZhang, XLi, JYang, WTong, LQu, RJiang, HDing, JXie, HLiu, H Design, synthesis and biological evaluation of novel 6-alkenylamides substituted of 4-anilinothieno[2,3-d]pyrimidines as irreversible epidermal growth factor receptor inhibitors. Bioorg Med Chem22:2366-78 (2014) 
 
Fibroblast growth factor receptor 1
Name:Fibroblast growth factor receptor 1
Type:Receptor
Mol. Mass.:91861.70
Organism:Homo sapiens (Human)
Description:P11362
Residue:822
BDBM50007745
NameBDBM50007745
Synonyms:CHEMBL3233785
TypeSmall organic molecule
Emp. Form.C23H21ClFN5O2S
Mol. Mass.485.962
SMILESFc1ccc(Nc2ncnc3sc(NC(=O)\C=C\CN4CC5CCC4C(=O)C5)cc23)cc1Cl