Reaction Details
TargetCarboxypeptidase B2
LigandBDBM50226610
Substrate/Competitorn/a
Meas. Tech.ChEMBL_1339182 (CHEMBL3243345)
IC50 5000±n/a nM
Citation Brink, MDahlén, AOlsson, TPolla, MSvensson, T Design and synthesis of conformationally restricted inhibitors of active thrombin activatable fibrinolysis inhibitor (TAFIa). Bioorg Med Chem22:2261-8 (2014) 
 
Carboxypeptidase B2
Name:Carboxypeptidase B2
Type:Enzyme
Mol. Mass.:48432.74
Organism:Homo sapiens (Human)
Description:Q96IY4
Residue:423
BDBM50226610
NameBDBM50226610
Synonyms:(2S)-5-AMINO-2-[(1-PROPYL-1H-IMIDAZOL-4-YL)METHYL]PENTANOIC ACID (S)-5-amino-2-((1-propyl-1H-imidazol-4-yl)methyl)pentanoic acid | CHEMBL398110
TypeSmall organic molecule
Emp. Form.C12H21N3O2
Mol. Mass.239.314
SMILESCCCn1cnc(C[C@H](CCCN)C(O)=O)c1