Reaction Details
TargetCarboxypeptidase B2
LigandBDBM50008278
Substrate/Competitorn/a
Meas. Tech.ChEMBL_1339182 (CHEMBL3243345)
IC50 1300±n/a nM
Citation Brink, MDahlén, AOlsson, TPolla, MSvensson, T Design and synthesis of conformationally restricted inhibitors of active thrombin activatable fibrinolysis inhibitor (TAFIa). Bioorg Med Chem22:2261-8 (2014) 
 
Carboxypeptidase B2
Name:Carboxypeptidase B2
Type:Enzyme
Mol. Mass.:48432.74
Organism:Homo sapiens (Human)
Description:Q96IY4
Residue:423
BDBM50008278
NameBDBM50008278
Synonyms:CHEMBL3235139
TypeSmall organic molecule
Emp. Form.C17H21N3O2
Mol. Mass.299.3675
SMILESNCCC[C@]1(CCn2c(C1)ncc2-c1ccccc1)C(O)=O