Reaction Details
TargetCarboxypeptidase B2
LigandBDBM50008272
Substrate/Competitorn/a
Meas. Tech.ChEMBL_1339189 (CHEMBL3243352)
IC50<41±n/a nM
Citation Brink, MDahlén, AOlsson, TPolla, MSvensson, T Design and synthesis of conformationally restricted inhibitors of active thrombin activatable fibrinolysis inhibitor (TAFIa). Bioorg Med Chem22:2261-8 (2014) 
 
Carboxypeptidase B2
Name:Carboxypeptidase B2
Type:Enzyme
Mol. Mass.:48432.74
Organism:Homo sapiens (Human)
Description:Q96IY4
Residue:423
BDBM50008272
NameBDBM50008272
Synonyms:CHEMBL3235133
TypeSmall organic molecule
Emp. Form.C16H28ClN3O2
Mol. Mass.329.865
SMILESCl.CC(C)CCn1cnc2C[C@@](CCCN)(CCc12)C(O)=O