Reaction Details
TargetCarboxypeptidase B2
LigandBDBM50008273
Substrate/Competitorn/a
Meas. Tech.ChEMBL_1339189 (CHEMBL3243352)
IC50 117±n/a nM
Citation Brink, MDahlén, AOlsson, TPolla, MSvensson, T Design and synthesis of conformationally restricted inhibitors of active thrombin activatable fibrinolysis inhibitor (TAFIa). Bioorg Med Chem22:2261-8 (2014) 
 
Carboxypeptidase B2
Name:Carboxypeptidase B2
Type:Enzyme
Mol. Mass.:48432.74
Organism:Homo sapiens (Human)
Description:Q96IY4
Residue:423
BDBM50008273
NameBDBM50008273
Synonyms:CHEMBL3235134
TypeSmall organic molecule
Emp. Form.C17H27N3O2
Mol. Mass.305.4152
SMILESNCCC[C@]1(CCc2c(C1)ncn2C1CCCCC1)C(O)=O