Reaction Details
TargetCarboxypeptidase B2
LigandBDBM50008274
Substrate/Competitorn/a
Meas. Tech.ChEMBL_1339189 (CHEMBL3243352)
IC50 106±n/a nM
Citation Brink, MDahlén, AOlsson, TPolla, MSvensson, T Design and synthesis of conformationally restricted inhibitors of active thrombin activatable fibrinolysis inhibitor (TAFIa). Bioorg Med Chem22:2261-8 (2014) 
 
Carboxypeptidase B2
Name:Carboxypeptidase B2
Type:Enzyme
Mol. Mass.:48432.74
Organism:Homo sapiens (Human)
Description:Q96IY4
Residue:423
BDBM50008274
NameBDBM50008274
Synonyms:CHEMBL3235135
TypeSmall organic molecule
Emp. Form.C24H27N3O2
Mol. Mass.389.4901
SMILESNCCC[C@]1(CCc2c(C1)ncn2Cc1cccc(c1)-c1ccccc1)C(O)=O