Reaction Details
TargetCarboxypeptidase N catalytic chain
LigandBDBM50008279
Substrate/Competitorn/a
Meas. Tech.ChEMBL_1339191 (CHEMBL3243354)
IC50>1000000±n/a nM
Citation Brink, MDahlén, AOlsson, TPolla, MSvensson, T Design and synthesis of conformationally restricted inhibitors of active thrombin activatable fibrinolysis inhibitor (TAFIa). Bioorg Med Chem22:2261-8 (2014) 
 
Carboxypeptidase N catalytic chain
Name:Carboxypeptidase N catalytic chain
Type:PROTEIN
Mol. Mass.:52293.66
Organism:Homo sapiens (Human)
Description:ChEMBL_1496379
Residue:458
BDBM50008279
NameBDBM50008279
Synonyms:CHEMBL3235140
TypeSmall organic molecule
Emp. Form.C23H24Cl3N3O2
Mol. Mass.480.815
SMILESCl.NCCC[C@]1(CCn2c(C1)ncc2-c1cccc(c1)-c1ccc(Cl)cc1Cl)C(O)=O