Reaction Details
TargetE3 ubiquitin-protein ligase Mdm2
LigandBDBM50008809
Substrate/Competitorn/a
Meas. Tech.ChEMBL_1336775 (CHEMBL3241171)
IC50 0.300000±n/a nM
Citation Gonzalez, AZLi, ZBeck, HPCanon, JChen, AChow, DDuquette, JEksterowicz, JFox, BMFu, JHuang, XHouze, JJin, LLi, YLing, YLo, MCLong, AMMcGee, LRMcIntosh, JOliner, JDOsgood, TRew, YSaiki, AYShaffer, PWortman, SYakowec, PYan, XYe, QYu, DZhao, XZhou, JOlson, SHSun, DMedina, JC Novel inhibitors of the MDM2-p53 interaction featuring hydrogen bond acceptors as carboxylic acid isosteres. J Med Chem57:2963-88 (2014) 
 
E3 ubiquitin-protein ligase Mdm2
Name:E3 ubiquitin-protein ligase Mdm2
Type:Oncoprotein
Mol. Mass.:55196.54
Organism:Homo sapiens (Human)
Description:Q00987
Residue:491
BDBM50008809
NameBDBM50008809
Synonyms:CHEMBL3236656
TypeSmall organic molecule
Emp. Form.C31H35Cl2FN2O3S2
Mol. Mass.637.656
SMILESCC(C)(C)S(=O)(=O)C[C@H](C1CC1)N1[C@@H]([C@H](C[C@](C)(Cc2nccs2)C1=O)c1cccc(Cl)c1)c1ccc(Cl)c(F)c1