Reaction Details
TargetMu-type opioid receptor
LigandBDBM50008835
Substrate/Competitorn/a
Meas. Tech.ChEMBL_1337150 (CHEMBL3240181)
Ki 0.158000±n/a nM
Citation Bai, LLi, ZChen, JChung, NNWilkes, BCLi, TSchiller, PW [Dmt(1)]DALDA analogues with enhancedµ opioid agonist potency and with a mixedµ/¿ opioid activity profile. Bioorg Med Chem22:2333-8 (2014) 
 
Mu-type opioid receptor
Name:Mu-type opioid receptor
Type:G Protein-Coupled Receptor (GPCR)
Mol. Mass.:44503.11
Organism:Rattus norvegicus (rat)
Description:Competition binding assays were carried out using membrane preparations from transfected HN9.10 cells that constitutively expressed the mu opioid receptor.
Residue:398
BDBM50008835
NameBDBM50008835
Synonyms:CHEMBL3236672
TypeSmall organic molecule
Emp. Form.C35H54N8O6
Mol. Mass.682.8533
SMILESCc1cc(C)c(C[C@H](NC(=O)[C@@H](CCCNC(N)=N)NC(=O)[C@@H](N)Cc2c(C)cc(O)cc2C)C(=O)N[C@@H](CCCCN)C(O)=O)c(C)c1