Reaction Details
TargetMu-type opioid receptor
LigandBDBM50008839
Substrate/Competitorn/a
Meas. Tech.ChEMBL_1337150 (CHEMBL3240181)
Ki 0.235000±n/a nM
Citation Bai, LLi, ZChen, JChung, NNWilkes, BCLi, TSchiller, PW [Dmt(1)]DALDA analogues with enhancedµ opioid agonist potency and with a mixedµ/¿ opioid activity profile. Bioorg Med Chem22:2333-8 (2014) 
 
Mu-type opioid receptor
Name:Mu-type opioid receptor
Type:G Protein-Coupled Receptor (GPCR)
Mol. Mass.:44503.11
Organism:Rattus norvegicus (rat)
Description:Competition binding assays were carried out using membrane preparations from transfected HN9.10 cells that constitutively expressed the mu opioid receptor.
Residue:398
BDBM50008839
NameBDBM50008839
Synonyms:CHEMBL3236676
TypeSmall organic molecule
Emp. Form.C36H50N8O6
Mol. Mass.690.8322
SMILESCc1cc(O)cc(C)c1C[C@H](N)C(=O)N[C@H](CCCNC(N)=N)C(=O)N[C@@H](Cc1ccc2ccccc2c1)C(=O)N[C@@H](CCCCN)C(O)=O