Reaction Details
TargetPlasminogen
LigandBDBM50009202
Substrate/Competitorn/a
Meas. Tech.ChEMBL_1338844 (CHEMBL3242934)
IC50 87000±n/a nM
Citation Teno, NGohda, KWanaka, KTsuda, YSueda, TYamashita, YOtsubo, T Pyrrolopyrimidine-inhibitors with hydantoin moiety as spacer can explore P4/S4 interaction on plasmin. Bioorg Med Chem22:2339-52 (2014) 
 
Plasminogen
Name:Plasminogen
Type:Enzyme
Mol. Mass.:90579.18
Organism:Homo sapiens (Human)
Description:n/a
Residue:810
BDBM50009202
NameBDBM50009202
Synonyms:CHEMBL3238376
TypeSmall organic molecule
Emp. Form.C30H31N9O4
Mol. Mass.581.625
SMILESCn1c(CN2C(=O)CN(C2=O)c2ccc(OCc3ccncc3)cc2)cc2cnc(nc12)C(=O)N[C@@H](CCCCN)C#N