Reaction Details
TargetUrokinase-type plasminogen activator
LigandBDBM50009210
Substrate/Competitorn/a
Meas. Tech.ChEMBL_1338846 (CHEMBL3242936)
IC50>1000000±n/a nM
Citation Teno, NGohda, KWanaka, KTsuda, YSueda, TYamashita, YOtsubo, T Pyrrolopyrimidine-inhibitors with hydantoin moiety as spacer can explore P4/S4 interaction on plasmin. Bioorg Med Chem22:2339-52 (2014) 
 
Urokinase-type plasminogen activator
Name:Urokinase-type plasminogen activator
Type:Enzyme
Mol. Mass.:48528.62
Organism:Homo sapiens (Human)
Description:P00749
Residue:431
BDBM50009210
NameBDBM50009210
Synonyms:CHEMBL3233153
TypeSmall organic molecule
Emp. Form.C31H32N8O4
Mol. Mass.580.637
SMILESCn1c(CN2CC(=O)N(CC2=O)c2ccc(Oc3ccccc3)cc2)cc2cnc(nc12)C(=O)N[C@@H](CCCCN)C#N