Reaction Details
TargetDelta-type opioid receptor
LigandBDBM50009265
Substrate/Competitorn/a
Meas. Tech.ChEMBL_1335007 (CHEMBL3239394)
IC50>10000±n/a nM
Citation Cai, JSong, BCai, YMa, YLam, ALMagiera, JSekar, SWyse, BDAmbo, ASasaki, YLazarus, LHSmith, MTLi, T Endomorphin analogues with mixedµ-opioid (MOP) receptor agonism/d-opioid (DOP) receptor antagonism and lackingß-arrestin2 recruitment activity. Bioorg Med Chem22:2208-19 (2014) 
 
Delta-type opioid receptor
Name:Delta-type opioid receptor
Type:Enzyme Catalytic Domain
Mol. Mass.:40577.25
Organism:MOUSE
Description:P32300
Residue:372
BDBM50009265
NameBDBM50009265
Synonyms:CHEMBL3233194
TypeSmall organic molecule
Emp. Form.C36H45N5O5
Mol. Mass.627.773
SMILESCc1cccc(C)c1C[C@H](NC(=O)[C@H](Cc1ccccc1)NC(=O)[C@@H]1CCCN1C(=O)[C@@H](N)Cc1c(C)cc(O)cc1C)C(N)=O