Reaction Details
TargetDelta-type opioid receptor
LigandBDBM50009270
Substrate/Competitorn/a
Meas. Tech.ChEMBL_1335007 (CHEMBL3239394)
IC50>10000±n/a nM
Citation Cai, JSong, BCai, YMa, YLam, ALMagiera, JSekar, SWyse, BDAmbo, ASasaki, YLazarus, LHSmith, MTLi, T Endomorphin analogues with mixedµ-opioid (MOP) receptor agonism/d-opioid (DOP) receptor antagonism and lackingß-arrestin2 recruitment activity. Bioorg Med Chem22:2208-19 (2014) 
 
Delta-type opioid receptor
Name:Delta-type opioid receptor
Type:Enzyme Catalytic Domain
Mol. Mass.:40577.25
Organism:MOUSE
Description:P32300
Residue:372
BDBM50009270
NameBDBM50009270
Synonyms:CHEMBL3233199
TypeSmall organic molecule
Emp. Form.C29H34N4O4
Mol. Mass.502.6047
SMILESCc1cc(O)cc(C)c1C[C@H](N)C(=O)N1CCC[C@H]1C(=O)N[C@@H](Cc1ccc2ccccc2c1)C(N)=O