Reaction Details
TargetDelta-type opioid receptor
LigandBDBM50149381
Substrate/Competitorn/a
Meas. Tech.ChEMBL_1335004 (CHEMBL3239391)
Ki 53±n/a nM
Citation Cai, JSong, BCai, YMa, YLam, ALMagiera, JSekar, SWyse, BDAmbo, ASasaki, YLazarus, LHSmith, MTLi, T Endomorphin analogues with mixedµ-opioid (MOP) receptor agonism/d-opioid (DOP) receptor antagonism and lackingß-arrestin2 recruitment activity. Bioorg Med Chem22:2208-19 (2014) 
 
Delta-type opioid receptor
Name:Delta-type opioid receptor
Type:G Protein-Coupled Receptor (GPCR)
Mol. Mass.:40382.98
Organism:Homo sapiens (Human)
Description:Competition binding assays were carried out using membrane preparations from transfected HN9.10 cells that constitutively expressed the delta opioid receptor.
Residue:372
BDBM50149381
NameBDBM50149381
Synonyms:1-[(S)-2-Amino-3-(4-hydroxy-2,6-dimethyl-phenyl)-propionyl]-pyrrolidine-2-carboxylic acid ((S)-1-carbamoyl-2-phenyl-ethyl)-amide | CHEMBL120758
TypeSmall organic molecule
Emp. Form.C25H32N4O4
Mol. Mass.452.546
SMILESCc1cc(O)cc(C)c1C[C@H](N)C(=O)N1CCC[C@H]1C(=O)N[C@@H](Cc1ccccc1)C(N)=O