Reaction Details
TargetProstaglandin G/H synthase 2
LigandBDBM50293282
Substrate/Competitorn/a
Meas. Tech.ChEMBL_1336447 (CHEMBL3242591)
IC50 18±n/a nM
Citation Ding, HXLeverett, CAKyne, RELiu, KKSakya, SMFlick, ACO'Donnell, CJ Synthetic approaches to the 2012 new drugs. Bioorg Med Chem22:2005-32 (2014) 
 
Prostaglandin G/H synthase 2
Name:Prostaglandin G/H synthase 2
Type:Protein
Mol. Mass.:69020.39
Organism:Mus musculus (Mouse)
Description:Q05769
Residue:604
BDBM50293282
NameBDBM50293282
Synonyms:CHEMBL504535 | Imrecoxib
TypeSmall organic molecule
Emp. Form.C21H23NO3S
Mol. Mass.369.477
SMILESCCCN1CC(=C(C1=O)c1ccc(C)cc1)c1ccc(cc1)S(C)(=O)=O