Reaction Details
TargetCannabinoid receptor 1
LigandBDBM50011329
Substrate/Competitorn/a
Meas. Tech.ChEMBL_1352142 (CHEMBL3267751)
Ki 12±n/a nM
Citation Ellsworth, BASher, PMWu, XWu, GSulsky, RBGu, ZMurugesan, NZhu, YYu, GSitkoff, DFCarlson, KEKang, LYang, YLee, NBaska, RAKeim, WJCullen, MJAzzara, AVZuvich, EThomas, MARohrbach, KWDevenny, JJGodonis, HEHarvey, SJMurphy, BJEverlof, GGStetsko, PIGudmundsson, OJohnghar, SRanasinghe, ABehnia, KPelleymounter, MAEwing, WR Reductions in log P improved protein binding and clearance predictions enabling the prospective design of cannabinoid receptor (CB1) antagonists with desired pharmacokinetic properties. J Med Chem56:9586-600 (2014) 
 
Cannabinoid receptor 1
Name:Cannabinoid receptor 1
Type:G Protein-Coupled Receptor (GPCR)
Mol. Mass.:52868.96
Organism:Homo sapiens (Human)
Description:P21554
Residue:472
BDBM50011329
NameBDBM50011329
Synonyms:CHEMBL3260749
TypeSmall organic molecule
Emp. Form.C28H22ClN5O2
Mol. Mass.495.96
SMILESCCn1nc2c(-c3ccc(Cl)cc3)c(-c3ccc(cc3)C#N)c(=O)n(Cc3ccc(C)cc3)n2c1=O